[stunnel-users] Error installing Stunnel-4.28

th at ftlabs.com th at ftlabs.com
Fri Nov 13 03:27:24 CET 2009

I could not get Stunnel-4.27 to work as described in a previous post  
on Mon Nov 9 17:12:38 CET 2009 to which nobody responded.

So I tried installing the latest version, Stunnel-4.28, and received  
the following error when running the 'make' command...

options.c: In function ‘service_options’:
options.c:1139: error: ‘SSL_OP_NO_TICKET’ undeclared (first use in  
this function)
options.c:1139: error: (Each undeclared identifier is reported only once
options.c:1139: error: for each function it appears in.)
options.c: In function ‘parse_ssl_option’:
options.c:1709: error: ‘SSL_OP_NO_TICKET’ undeclared (first use in  
this function)
make[1]: *** [options.o] Error 1
make[1]: Leaving directory `/tmp/stunnel-4.28/src'
make: *** [all-recursive] Error 1

The output for 'openssl version' is: OpenSSL 0.9.8e-fips-rhel5 01 Jul  

Can anyone help me with either problems please?

More information about the stunnel-users mailing list