[stunnel-users] Error 126 compiling on Mac OS X 10.7.5

James Brown jlbrown at bordo.com.au
Tue Apr 29 04:05:05 CEST 2014

I’ve just tried to install version 5.01 and encountered an error. I had no problems installing 5.01b1 previously. I just thought I’d install the release version.

System is running Mac OS X 10.7.5.

make ends with a warning, and make install fails:

ld: warning: directory not found for option '-L/usr//lib64'
Making all in doc
make[1]: Nothing to be done for `all'.
Making all in tools
make[1]: Nothing to be done for `all'.
make[1]: Nothing to be done for `all-am'.
mail:stunnel-5.01 2 jlbrown$ sudo make install
Making install in src
 ../auto/install-sh -c -d '/usr/local/bin'
  /bin/sh ../libtool   --mode=install /usr/bin/install -c stunnel '/usr/local/bin'
libtool: install: /usr/bin/install -c stunnel /usr/local/bin/stunnel
 ../auto/install-sh -c -d '/usr/local/bin'
 /usr/bin/install -c stunnel3 '/usr/local/bin'
 ../auto/install-sh -c -d '/usr/local/lib/stunnel'
 /bin/sh ../libtool   --mode=install /usr/bin/install -c   libstunnel.la '/usr/local/lib/stunnel'
libtool: install: /usr/bin/install -c .libs/libstunnel.dylib /usr/local/lib/stunnel/libstunnel.dylib
libtool: install: /usr/bin/install -c .libs/libstunnel.lai /usr/local/lib/stunnel/libstunnel.la
/Users/jlbrown/Downloads/stunnel-5.01: /Users/jlbrown/Downloads/stunnel-5.01: is a directory
make[2]: *** [install-pkglibLTLIBRARIES] Error 126
make[1]: *** [install-am] Error 2
make: *** [install-recursive] Error 1

I just used ./configure with no arguments.

Any suggestions?



More information about the stunnel-users mailing list